{"text_format":"1","workbook":"xlsx","n_sheets":9,"sheets":["案件情報","構成シート","構成シート (入力サンプル)","マスター_要件シート用","メンテナンス用","CPW表","＜参考資料＞パワーサイレンサーとスマートトレイ","vlook","SWMA"],"not_rendered":{"charts":0,"images":10,"macros":1,"external_links":0,"defined_names":60,"comments":1,"pivot_tables":0},"unopened":[],"bounds":{"document_bytes":16777216,"sheet_cells":100000,"rows_first":2000,"rows_last":500,"rows_between":2000,"halvings":0,"cell_chars":16384,"cell_head_chars":4096},"cells_cut":0,"cells_raw":0,"read":"whole","date_system":"1900"}

{"sheet":"案件情報","index":0,"n_rows":24,"n_cols":24,"rows_kept":24,"cut":false,"hidden":false,"merged":[[10,13,10,24],[13,13,13,24],[13,7,13,9],[7,7,7,10],[13,3,13,4],[14,10,14,12],[14,7,14,9],[13,5,13,6],[12,3,12,6],[11,3,11,6],[14,5,14,6],[4,21,4,24],[4,18,4,20],[6,1,6,4],[6,14,6,24],[10,3,10,4],[4,1,4,3],[4,4,4,12],[4,16,4,17],[6,5,6,6],[6,7,6,13],[10,5,10,6],[4,14,4,15],[9,1,9,24],[7,11,7,24],[8,1,8,24],[7,1,7,6],[1,1,1,22],[1,23,1,24],[2,23,2,24],[3,20,3,21],[3,22,3,24],[3,1,3,3],[3,4,3,12],[3,16,3,19],[3,14,3,15],[23,7,23,24],[23,1,23,6],[22,7,22,16],[22,1,22,6],[22,17,22,24],[18,1,21,2],[18,3,21,6],[18,7,18,12],[18,13,18,18],[18,19,18,24],[19,7,19,10],[20,7,20,12],[20,13,21,24],[21,7,21,10],[21,11,21,12],[19,11,19,12],[19,13,19,16],[19,17,19,18],[19,19,19,22],[19,23,19,24],[15,13,15,24],[16,13,16,14],[17,13,17,14],[10,1,17,2],[15,3,17,6],[15,7,17,12],[14,13,14,24],[14,3,14,4],[13,10,13,12],[10,7,10,9],[10,10,10,12],[11,13,11,24],[12,13,12,24],[12,7,12,12],[11,8,11,9],[11,11,11,12]]}
[null,"UPDATE　：　2025/2/27"]
[]
[]
[null,"貴社名(ご担当者様)",null,null,null,null,null,null,null,null,null,null,null,"様","既存モデル",null,null,null,null,null,"シリアル番号"]
[null,"お客様(EU)名",null,null,null,null,null,null,null,null,null,null,null,"様","発注時期",null,"要選択",null,"Opportunity ID"]
[]
[null,"LPAR構成希望",null,null,null,"要選択",null,"要選択",null,null,null,null,null,null,"※お打ち合わせご希望の場合には、partnercontact@i-guazu.co.jp へご依頼ください。"]
[{"$f":"CONCATENATE(F7,H8)","v":"要選択要選択"},"既存機同等希望(NonLPAR)",null,null,null,null,null,"要選択",null,null,null,"※｢はい｣を選択時、各HW保守のご指定までお願いいたします。\n (HW：既存機を元に構成 SW：既存踏襲 / ご指定箇所がある場合は｢■ご要望｣欄に記入ください)"]
[null,"■ご要望　　　※下記に記載できないHWの要望やSWに関する詳細な要望を記入ください。"]
[]
[null,"各HW",null,"オーダー",null,"用途",null,"要選択",null,null,"要選択"]
[null,null,null,"Primary Machine",null,null,null,"M/T：","必須",null,"S/N：","必須",null,"CBU機のみ ※未導入の場合は機械グループを指定"]
[null,null,null,"電圧指定",null,null,null,"要選択"]
[null,null,null,"保守締結タイプ",null,"年数",null,"ExpertCare",null,null,"要選択",null,null,"※ExpertCare設定のない製品は同等で選定"]
[null,null,null,"サービスレベル",null,"SIオプション",null,"要選択",null,null,"MR",null,null,"※MR (メディアリテンションサービス) ： ハードディスク/メディアお渡し (3年/5年のみ)"]
[null,null,null,"設定サポート",null,null,null,"不要",null,null,null,null,null,"※設定サポートはPowerとStorageでサポート内容が異なりますので、ご注意ください。"]
[null,null,null,null,null,null,null,null,null,null,null,null,null,"Power：",null,"https://www.ibm.com/docs/ja/announcements/q2-2020-si-release-additional-hw-products"]
[null,null,null,null,null,null,null,null,null,null,null,null,null,"Storage：",null,"https://www.ibm.com/docs/ja/announcements/gl-si-storage-52k-72k-mss-3q-2021?region=AP"]
[null,"SW",null,"主要ライセンス\nOption Edition等/数量",null,null,null,"Rational Development Studio for i (WDS)",null,null,null,null,null,"Rational Developer for i (RDW)",null,null,null,null,null,"Backup Recovery and Media Services for i (BR2)"]
[null,null,null,null,null,null,null,"要選択",null,null,null,"要選択",null,"要選択",null,null,null,"要選択",null,"要選択",null,null,null,"OSと同数"]
{"$rows_left_out":5}
{"sheet":"構成シート","index":1,"n_rows":82,"n_cols":16,"rows_kept":82,"cut":false,"hidden":false,"merged":[[81,1,81,2],[41,1,41,2],[21,3,21,4],[19,1,19,2],[19,3,19,4],[45,1,47,1],[59,1,59,2],[58,1,58,2],[56,1,56,2],[39,1,39,2],[42,1,42,2],[40,1,40,2],[20,3,20,4],[23,3,23,4],[79,1,79,2],[72,1,72,2],[3,1,3,2],[7,1,7,2],[3,3,3,4],[5,1,5,2],[17,1,17,2],[9,3,9,4],[10,3,10,4],[10,1,10,2],[16,3,16,4],[12,3,12,4],[17,3,17,4],[11,3,11,4],[13,3,13,4],[9,1,9,2],[4,1,4,2],[14,3,14,4],[0,3,0,4],[1,3,1,4],[2,3,2,4],[6,3,6,4],[8,3,8,4],[5,3,5,4],[7,3,7,4],[78,1,78,2],[77,1,77,2],[73,1,73,2],[76,1,76,2],[74,1,74,2],[75,1,75,2],[18,1,18,2],[18,3,18,4],[71,1,71,2],[57,1,57,2],[69,1,69,3],[70,1,70,2],[22,3,22,4]]}
[]
[null,"モデル ",null,"要選択"]
[null,"プロセッサー・カードの種類　機械G",null,"要選択"]
[null,"HW機械グループ",null,{"$f":"IF(AND(OR(LEFT($D$2,4)=\"1014\",LEFT($D$2,4)=\"1012\"),OR(LEFT($D$3,2)=\"4C\",LEFT($D$3,2)=\"1C\")),\"P05\",HLOOKUP($D$2,メンテナンス用!$P$61:$V$81,2,FALSE))","v":{"$error":"#N/A"}}]
[null,"Primary Machine",null,{"$f":"案件情報!I12","v":"必須"},{"$f":"案件情報!L12","v":"必須"}]
[null,"1CoreあたりのCPW値(※1)",null,{"$f":"INDEX(CPW表!$AK$4:$AK$316,MATCH(LEFT($D$2,4)&$D$3&$D$8&\"core\",INDEX(CPW表!$AF$4:$AF$316&CPW表!$AG$4:$AG$316&CPW表!$AH$4:$AH$316,),0))","v":{"$error":"#VALUE!"}}]
[null,"プロセッサー・カードの枚数",null,"要選択"]
[null,"Core総数",null,{"$f":"LEFT(D3,SEARCH(\"core\",D3,1)-1)*D7","v":{"$error":"#VALUE!"}}]
[null,"プロセッサー・ライセンス数(IBM i)",null,{"$f":"D31","v":0}]
[null,"ユーザー数 (IBM i)",null,"要選択"]
[null,"エンタープライズ・エネーブルメント数",null,"要選択"]
[{"$f":"案件情報!H8","v":"要選択"},"NonLPAR/LPAR",null,{"$f":"案件情報!F7","v":"要選択"}]
[null,"コンソール",null,"要選択"]
[null,"HMC&TF5",null,"要選択"]
[null,"筐体タイプ",null,"要選択"]
[null,"一次言語","二次言語","日本語 漢字","不要"]
[null,"電源",null,{"$f":"案件情報!H13","v":"要選択"}]
[null,"CPU Deconfiguration",null,"不要"]
[null,"メディア出荷",null,"有"]
[null,"ｉOS プリロード",null,"要選択"]
{"$rows_left_out":63}
{"sheet":"構成シート (入力サンプル)","index":2,"n_rows":189,"n_cols":3,"rows_kept":189,"cut":false,"hidden":false,"merged":[[5,2,7,2],[188,0,223,0],[11,0,36,0],[39,0,71,0],[75,0,107,0],[112,0,144,0],[149,0,181,0]]}
[null,"※構成シートに戻る"]
[]
[null,"サンプル（下記をクリック）","論理区画(LPAR)の作成方法"]
[null,"NonLPAR","1区画で利用"]
[null,"物理LPAR","物理ディスクを利用"]
[null,"仮想LPAR （ホスト兼本番区画）","IBM i をホストとして仮想ディスクを利用"]
[null,"仮想LPAR （ホスト専用区画）"]
[null,"仮想LPAR （仮想LPAR_VPM ※HMCなし）"]
[null,"VIOS","VIOS をホストとして仮想ディスクを利用"]
[]
[]
["戻る"]
[]
[]
[]
[]
[]
[]
[]
[]
{"$rows_left_out":170}
{"sheet":"マスター_要件シート用","index":3,"n_rows":12,"n_cols":2,"rows_kept":12,"cut":false,"hidden":true,"merged":[]}
[]
["保守契約タイプ","ExpertCare"]
[]
["年数","5年"]
[null,"4年"]
[null,"3年"]
[]
[]
["サービスレベル","要選択"]
[null,"Basic ※9x5"]
[null,"Advanced"]
[null,"Premium"]

{"sheet":"メンテナンス用","index":4,"n_rows":95,"n_cols":28,"rows_kept":95,"cut":false,"hidden":true,"merged":[[2,8,2,19]]}
[]
[]
["ディスク","ディスク保護","外部ストレージ",null,"テープ装置","テープ接続","Fibre種類","導入場所","外部ストレージ"]
["283GB (15k)","Dev.Lv.","モデル選択","V7000","RDX(内蔵)","SAS","16Gb 2port","CEC","モデル選択","FS5015","FS5045","FS5300","FS7300","FS9500","FS5200(24.12.31WD)","V7000_724_10.17WD","V7000F_AF6_8.15WD","FS900_11.20WD","FS9110_10.17WD","FS9150_10.17WD","FS5100","FS7200","FS9200","FS5035"]
["571GB (10k)","IOA Lv.","V5010E","NVMe","7226-1U3","FIBRE","32Gb 2port","EXP24Sx",null,"外部ディスク玉"]
["571GB (15k)","仮想","V5030E","Flash/SSDs","TS2270(24.6.30WD)","USB(RDX)","32Gb 4port",null,"ディスク種類選択","ディスク種類選択","ディスク種類選択","ディスク種類選択","ディスク種類選択","ディスク種類選択","ディスク種類選択","ディスク種類選択","ディスク種類選択","ディスク種類選択","ディスク種類選択","ディスク種類選択","ディスク種類選択","ディスク種類選択","ディスク種類選択","ディスク種類選択"]
["856GB (10k)※5/19WD","RAID5","V5100","HDD","TS2280",null,"64Gb 2port",null,null,"Flash_SSDｓ","Flash_SSDｓ","FCM","FCM","FCM","FCM","NVMe基本筐体","Flash_SSDｓ","FlashModule","NVMe_基本筐体","NVMe_基本筐体","NVMe基本筐体","FCM","FCM","Flash_SSDｓ"]
["1.1TB (10k)※5/19WD","RAID6","V7000",null,"TS2290",null,null,null,null,"HDD","HDD","FlashDrive","FlashDrive","FlashDrive","FlashDrive","Flash_SSDｓ",null,null,"FlashDrive_拡張筐体","FlashDrive_拡張筐体","FlashDrive_拡張筐体","FlashDrive","FlashDrive","HDD"]
["1.7TB (10k)※5/19WD","LVM(SW)","FS9110","V7000F","TS2900",null,null,null,null,null,null,"HDD(拡張筐体のみ)","HDD(拡張筐体のみ)",null,"HDD(拡張筐体のみ)","HDD",null,null,null,null,"HDD","HDD(拡張筐体のみ)"]
["387GB SSD","RAID10(HW)","FS9150","Flash/SSDs","TS4300基本"]
["775GB SSD",null,"FS900",null,"TS4300拡張",null,null,null,"キャッシュ選択","キャッシュ選択","キャッシュ選択","キャッシュ選択","キャッシュ選択","キャッシュ選択","キャッシュ選択"]
["931GB RI SSD",null,null,"FS900","└LTO9",null,null,null,null,"32GB","32GB","64GB (一部機能使用不可)","256GB","1024GB","64GB"]
["1.55TB SSD",null,null,"FlashModule","└LTO8",null,null,null,null,"64GB","64GB(重複排除必須）","256GB","768GB","2048GB","256GB"]
["1.86TB SSD","外部ストレージ保護","外部ディスク",null,"└LTO7(24.6.30WD)",null,null,null,null,null,null,"512GB","1536GB","3072GB","512GB"]
["3.72TB RI SSD","選択","V50x0","FS91x0","└RDX"]
["7.45TB RI SSD","DRAID1","ディスク種類選択","NVMe",null,null,null,null,"インタフェース選択","インタフェース選択","インタフェース選択","インタフェース選択","インタフェース選択","インタフェース選択","インタフェース選択"]
["AIX,VIOS用 300GB","DRAID5","Flash/SSDs","Flash/SSDs",null,null,null,null,null,"16G FC","16G FC","32G FC","32G FC","32G FC","16G FC"]
["AIX,VIOS用 600GB","DRAID6","HDD",null,null,null,null,null,null,"1G iSCSI","1G iSCSI","64G FC","64G FC","64G FC","32G FC"]
["AIX,VIOS用 600GB (10k)",null,null,null,null,null,null,null,null,"10G iSCSI","10G iSCSI","10G iSCSI","25GbE(iWARP)","25GbE(iWARP)","10G iSCSI"]
["AIX,VIOS用 900GB (10k)※5/19WD",null,"V5100",null,null,null,null,null,null,"12G SAS","12G SAS","25/10GbE(オンボード)","100GbE","100GbE","25GbE(iWARP)"]
{"$rows_left_out":76}
{"sheet":"CPW表","index":5,"n_rows":304,"n_cols":103,"rows_kept":304,"cut":false,"hidden":true,"merged":[[3,42,7,42],[3,51,6,51],[3,56,25,56],[7,51,9,51],[8,42,19,42],[10,51,11,51],[12,51,17,51],[20,42,22,42],[23,42,45,42],[26,56,29,56],[27,51,28,51],[29,51,36,51],[17,79,17,80],[17,81,17,82],[17,83,17,84],[17,85,17,86],[18,51,26,51],[72,42,76,42],[145,31,149,31],[150,31,155,31],[30,56,37,56],[37,51,38,51],[38,56,65,56],[39,51,49,51],[46,42,71,42],[50,51,53,51],[54,51,59,51]]}
[]
[null,null,"Power10",null,null,null,null,null,null,null,null,null,"Power9",null,null,null,null,null,null,null,null,null,"Power8",null,null,null,null,null,null,null,null,null,"Power7",null,null,null,null,null,null,null,null,null,"Power6",null,null,null,null,null,null,null,null,"Power5（rPerfのみ）"]
[null,"モデル","プロセッサカード","core数","総CPW値","総rPerf値\nSMT8","CPW/core","rPerf/Core",null,null,null,"モデル","プロセッサカード","core数","総CPW値","総rPerf値\nSMT4","CPW/core","rPerf/Core",null,null,null,"モデル","プロセッサカード","core数","総CPW値","総rPerf値\nSMT4","CPW/core","rPerf/Core",null,null,null,"モデル","プロセッサカード","core数","総CPW値","総rPerf値","CPW/core","rPerf/Core","Chips",null,null,null,"モデル","Core数","Clock","総CPW値","総rPerf値","CPW/Core","rPerf/Core","備考",null,"Model","Processor\n/ #Cores","MHz","rPerf",null,"Model","Processor\n/ #Cores","MHz","rPerf",null,null,null,null,null,null,null,null,null,null,null,null,"Model","CPW","Model","CPW","Model","CPU","CPW","Model","CPU","V3R6","V3R7","V4","Model","CPU","CPW",5250,null,"Model","CPU","CPW",5250,"Model","CPU FC","CPW","対話FC",5250,"ドミノ専用サーバー"]
[null,1012,"1core 3.00-3.90GHz P10","1core",29000,"-",{"$f":"E4/LEFT($D4,SEARCH(\"core\",$D4)-1)","v":29000},{"$error":"#VALUE!"},null,null,null,914,"4core 2.3-3.8GHz P9","4core",52500,60.4,{"$f":"O4/LEFT($N4,SEARCH(\"core\",$N4)-1)","v":13125},15.1,null,null,null,812,"1core 3.02GHz P8","1core",9880,null,{"$f":"IFERROR(Y4/LEFT($X4,SEARCH(\"core\",$X4)-1),\"\")","v":9880},{"$f":"Z4/LEFT($X4,SEARCH(\"core\",$X4)-1)","v":0},null,null,null,710,"4core 3.0GHz P7","4core",23800,45.13,{"$f":"AI4/LEFT($AH4,SEARCH(\"core\",$AH4)-1)","v":5950},11.282500000000001,1,null,null,null,520,1,4.2,4300,8.39,{"$f":"AT4/AR4","v":4300},{"$f":"AU4/AR4","v":8.39},null,null,"JS20 ","PPC970/1 ",1600,1.53,null,"p5-570 ","P5/2",1500,9.1300000000000008,null,null,null,null,null,null,null,null,null,null,null,null,"B10",2.9,"E02",4.5,200,2030,7.3,400,2130,12.3,13.8,13.8,"20S",2010,17.100000000000001,5.5,null,170,2159,73,16,720,2061,240,1500,35,"Model","CPU FC","CPW"]
[null,1012,"4core 3.00-3.90GHz P10","4core",111300,130.4,27825,32.6,null,null,null,914,"6core 2.3-3.8GHz P9","6core",78500,88.5,13083.333333333334,14.75,null,null,null,812,"4core 3.02GHz P8","4core",null,62.5,{"$f":"Y5/LEFT($X5,SEARCH(\"core\",$X5)-1)","v":0},{"$f":"Z5/LEFT($X5,SEARCH(\"core\",$X5)-1)","v":15.625},null,null,null,710,"6core 3.7GHz P7","6core",40900,76.69,6816.666666666667,12.781666666666666,1,null,null,null,null,2,4.2,8300,15.95,4150,7.9749999999999996,null,null,null,"PPC970/2 ",1600,2.65,null,null,"P5/4",1500,18.2,null,null,null,null,null,null,null,null,null,null,null,null,"B20",5.0999999999999996,"E04",5.5,null,2031,11.6,null,2131,18.3,20.6,20.6,"30S",2411,32.299999999999997,9.6,null,null,2160,114,23,null,2062,420,1501,70,270,2422,50]
[null,1012,"8core 3.00-3.90GHz P10","8core",203100,234.2,25387.5,29.274999999999999,null,null,null,914,"8core 2.8-3.8GHz P9","8core",122500,136.5,15312.5,17.0625,null,null,null,814,"4core 3.02GHz P8","4core",39500,62.5,{"$f":"Y6/LEFT($X6,SEARCH(\"core\",$X6)-1)","v":9875},{"$f":"Z6/LEFT($X6,SEARCH(\"core\",$X6)-1)","v":15.625},null,null,null,710,"8core 3.55GHz P7","8core",51800,91.96,6475,11.494999999999999,1,770,"12core 3.72GHz P7","24core",null,2,4.7,9500,20.13,4750,10.065,null,null,null,"PPC970/1 ",2200,1.95,null,null,"P5/8",1500,34.46,null,null,null,null,null,null,null,null,null,null,null,null,"B30",3.8,"E06",7.3,null,2032,16.8,null,2132,24.5,27,27,null,2412,68.5,11.6,null,null,2164,210,29,null,2063,810,1502,120,null,2423,100]
[null,1014,"4core 3.00-3.90GHz P10","4core",106300,129.4,26575,32.35,{"$f":"G7","v":26575},null,null,922,"8core 3.4-3.9GHz P9","8core",68000,160.5,17000,20.0625,68000,null,null,814,"6core 3.02GHz P8","6core",59500,91.1,{"$f":"Y7/LEFT($X7,SEARCH(\"core\",$X7)-1)","v":9916.6666666666661},{"$f":"Z7/LEFT($X7,SEARCH(\"core\",$X7)-1)","v":15.183333333333332},null,null,null,710,"4core 3.6GHz P7+","4core",28400,53.9,7100,13.475,1,null,null,null,null,4,4.2,15600,31.48,3900,7.87,null,null,null,"PPC970/2 ",2200,3.4,null,null,"P5/2",1650,9.86,null,null,null,null,null,null,null,null,null,null,null,null,"B35",4.5999999999999996,"E10",7.6,300,2040,11.6,null,2133,30.6,33.299999999999997,35,null,null,null,null,null,null,2176,319,40,null,2064,1600,1503,240,null,2424,200]
[null,1014,"8core 3.00-3.90GHz P10","8core",205300,254.2,25662.5,31.774999999999999,{"$f":"I7","v":26575},null,null,922,"10core 2.9-3.8GHz P9","10Core",60000,173.5,15000,17.350000000000001,60000,null,null,814,"8core 3.72GHz P8","8core",85500,134.5,{"$f":"Y8/LEFT($X8,SEARCH(\"core\",$X8)-1)","v":10687.5},{"$f":"Z8/LEFT($X8,SEARCH(\"core\",$X8)-1)","v":16.8125},null,null,null,710,"6core 4.2GHz P7+","6core",49400,90.6,8233.3333333333339,15.1,1,null,null,null,null,4,4.7,18300,39.729999999999997,4575,9.9324999999999992,null,null,"JS21 ","PPC970+/2 ",2700,5.31,null,null,"P5/4",1650,19.66,null,null,null,null,null,null,null,null,null,null,null,null,"B40",5.2,"E20",9.6999999999999993,null,2041,16.8,500,2140,18.7,21.4,21.4,null,null,null,null,null,null,2183,319,67,null,null,null,1504,560,null,2452,100]
[null,1022,"4core 3.00-3.90GHz P10","8core",198200,129.4,{"$f":"E9/LEFT($D9,SEARCH(\"core\",$D9)-1)","v":24775},16.175000000000001,{"$f":"I8","v":26575},null,null,922,"8core 3.4-3.9GHz P9","16core",68000,160.5,17000,10.03125,68000,null,null,822,"6core 3.89GHz P8","6core",{"$f":"AC9/2*(--SUBSTITUTE(X9,\"core\",\"\"))","v":76500},112.9,{"$f":"IFERROR(Y9/LEFT($X9,SEARCH(\"core\",$X9)-1),\"\")","v":12750},{"$f":"Z9/LEFT($X9,SEARCH(\"core\",$X9)-1)","v":18.816666666666666},25500,"***",null,710,"8core 4.2GHz P7+","8core",64500,115.5,8062.5,14.4375,1,null,null,null,550,2,3.5,7750,15.85,3875,7.9249999999999998,null,null,null,"PPC970+/4 ",2500,8.7200000000000006,null,null,"P5/8",1650,37.22,null,null,null,null,null,null,null,null,null,null,null,null,"B45",6.5,"E25",11.8,null,2042,21.1,null,2141,26.9,30.7,30.7,null,null,null,null,null,null,2289,50,15,null,null,null,1505,1050,null,2454,240]
[null,1022,"8core 3.00-3.90GHz P10","8core",null,254.2,{"$f":"I7","v":26575},31.774999999999999,{"$f":"I9","v":26575},null,null,922,"10core 2.9-3.8GHz P9","20Core",60000,173.5,15000,8.6750000000000007,60000,null,null,822,"6core 3.89GHz P8","12core",153000,220.2,{"$f":"Y10/LEFT($X10,SEARCH(\"core\",$X10)-1)","v":12750},18.349999999999998,25500,"***",null,720,"4core 3.0GHz P7","4core",23800,45.13,5950,11.282500000000001,1,null,null,null,null,2,4.2,9200,18.38,4600,9.19,null,null,null,"PPC970+/4 ",2300,8.15,null,null,"P5/12",1650,53.43,null,null,null,null,null,null,null,null,null,null,null,null,"B50",9.3000000000000007,"E35",9.6999999999999993,310,2043,33.799999999999997,null,2142,38.299999999999997,43.9,43.9,null,null,null,null,null,null,2290,73,20,730,2065,560,1506,70,820,2425,100]
[null,1022,"8core 3.00-3.90GHz P10","16core",null,477.8,{"$f":"I8","v":26575},29.862500000000001,26175,null,null,924,"8core 3.8-4.0GHz P9","8core",145500,174.1,{"$f":"O11/LEFT($N11,SEARCH(\"core\",$N11)-1)","v":18187.5},21.762499999999999,null,null,null,822,"8core 4.15GHz P8","8core",108000,155.1,{"$f":"IFERROR(Y11/LEFT($X11,SEARCH(\"core\",$X11)-1),\"\")","v":13500},19.387499999999999,27000,"***",null,720,"6core 3.0GHz P7","6core",34900,65.52,5816.666666666667,10.92,1,null,null,null,null,2,5,10600,21.18,5300,10.59,null,null,"IS-285 ","P5+/2 ",1900,"-- ",null,null,"P5/16",1650,68.400000000000006,null,null,null,null,null,null,null,null,null,null,null,null,"B60",15.1,"E45",13.8,null,2044,56.5,510,2143,66.7,77.7,81.599999999999994,null,null,null,null,null,null,2291,115,25,null,2066,1050,1507,120,null,2426,200]
[null,1022,"12core 2.90-4.00GHz P10","12core",null,null,26575,null,26575,null,null,924,"8core 3.8-4.0GHz P9","16Core",268500,339.5,16781.25,21.21875,null,null,null,822,"8core 4.15GHz P8","16core",216000,302.39999999999998,13500,18.899999999999999,27000,"***",null,720,"8core 3.0GHz P7","8core",46300,81.239999999999995,5787.5,10.154999999999999,1,null,null,null,null,4,3.5,15000,31.27,3750,7.8174999999999999,null,null,null,"P5+/2 ",2100,"-- ",null,null,"P5/2 ",1900,11.16,null,null,null,null,null,null,null,null,null,null,null,null,"B70",20,"E50",18.100000000000001,320,2050,67.5,null,2144,85,104.2,111.5,null,null,null,null,null,null,2292,220,30,null,2067,2000,1508,240,null,2427,300]
[null,1022,"16core 2.75-4.00GHz P10","16core",null,null,26575,null,26575,null,null,924,"10core 3.5-3.9GHz P9","10Core",174500,203.3,17450,20.330000000000002,null,null,null,822,"10core 3.42GHz P8","10core",115000,166.2,{"$f":"IFERROR(Y13/LEFT($X13,SEARCH(\"core\",$X13)-1),\"\")","v":11500},16.619999999999997,23000,"***",null,720,"4core 3.6GHz P7+","4core",28400,53.9,7100,13.475,1,{"$f":"INDEX(AK4:AK148,MATCH($AN6&$AO6&$AP6,INDEX($AF$4:$AF$140&$AG$4:$AG$148&$AH$4:$AH$148,),0))","v":5662.5},{"$f":"INDEX(AL4:AL148,MATCH($AN6&$AO6&$AP6,INDEX($AF$4:$AF$140&$AG$4:$AG$148&$AH$4:$AH$148,),0))","v":11.404166666666667},null,null,4,4.2,18000,36.28,4500,9.07,null,null,"p5-505 ","P5/2 ",1500,9.1300000000000008,null,null,"P5/4 ",1900,22.26,null,null,null,null,null,null,null,null,null,null,null,null,"C04",3.1,"E60",28.1,null,2051,120.3,530,2150,107.1,131.1,148,null,null,null,null,null,null,2385,460,50,null,2068,2890,1509,560,null,2456,120]
[null,1022,"20core 2.45-3.90GHz P10","20core",null,null,26175,null,26175,null,null,924,"10core 3.5-3.9GHz P9","20Core",318000,396.4,15900,19.82,null,null,null,822,"10core 3.42GHz P8","20core",230000,324,11500,16.2,23000,"***",null,720,"6core 3.6GHz P7+","6core",42400,79.5,7066.666666666667,13.25,1,null,null,null,null,4,5,20550,41.81,5137.5,10.452500000000001,null,null,null,"P5/1 ",1650,3.51,null,null,"P5/8 ",1900,42.14,null,null,null,null,null,null,null,null,null,null,null,null,"C06",3.6,"E70",39.200000000000003,null,2052,177.4,null,2151,132.5,162.69999999999999,188.2,null,null,null,null,null,null,2386,460,70,null,null,null,1510,1050,null,2457,240]
[null,1022,"12core 2.90-4.00GHz P10","24core",null,null,26575,null,null,null,null,924,"12core 3.4-3.9GHz P9","24Core",370700,462.7,15445.833333333334,19.279166666666665,null,null,null,824,"6core 3.89GHz P8","6Core",72000,112.9,12000,18.816666666666666,null,null,null,720,"8core 3.6GHz P7+","8core",56300,102.4,7037.5,12.8,1,null,null,null,null,6,3.5,20300,45.04,3383.3333333333335,7.5066666666666668,null,null,null,"P5/2 ",1650,9.86,null,null,"P5/12 ",1900,60.5,null,null,null,null,null,null,null,null,null,null,null,null,"C10",3.9,"E80",69.400000000000006,600,2129,22.7,null,2152,198.7,278.8,319,null,null,null,null,null,null,2388,1090,70,null,null,null,1511,2000,null,2458,380]
[null,1022,"16core 2.75-4.00GHz P10","32core",null,null,26575,null,null,null,null,980,"24core 3.58-3.9GHz P9","24Core",381000,533.70000000000005,15875,22.237500000000001,null,null,null,824,"6core 3.89GHz P8","12Core",130000,220.2,10833.333333333334,18.349999999999998,null,null,null,730,"4core 3.0GHz P7","8core",44600,86.66,5575,10.8325,2,null,null,null,null,6,4.2,23850,52.24,3975,8.706666666666667,null,null,null,"P5+/1 ",1900,4.0999999999999996,null,null,"P5/16 ",1900,77.45,null,null,null,null,null,null,null,null,null,null,null,null,"C20",5.3,"E90",96.7,null,2134,32.5,null,2153,299,459.3,598,null,null,null,null,null,null,2407,30,10,740,2069,3660,1514,120,"アプリケーション・サーバー"]
[null,1022,"20core 2.45-3.90GHz P10","40core",null,null,26175,null,null,null,null,980,"24core 3.58-3.9GHz P9","48Core",759000,1067.3,15812.5,22.235416666666666,null,null,null,824,"8core 4.15GHz P8",4,94500,155.1,{"$error":"#VALUE!"},{"$error":"#VALUE!"},null,null,null,730,"4core 3.7GHz P7","8core",51900,101.62,6487.5,12.702500000000001,2,null,null,null,null,6,5,28800,60.2,4800,10.033333333333333,null,null,null,"P5+/2 ",1900,11.49,null,null,"P5+/2 ",1900,12.27,null,null,null,null,null,null,null,null,null,null,null,null,"C25",6.1,"E95",116.6,null,2135,45.4,null,2162,349.8,509.9,650,null,null,null,null,null,null,2408,60,15,null,2070,4550,1510,1050,"Model","CPU FC","CPW"]
[null,1024,"12core 3.40-4.00GHz P10","12core",312500,null,{"$f":"E18/LEFT($D18,SEARCH(\"core\",$D18)-1)","v":26041.666666666668},null,null,null,null,980,"24core 3.58-3.9GHz P9","72Core",1140000,1601,15833.333333333334,22.236111111111111,null,null,null,824,"8core 4.15GHz P8","16Core",173500,302.39999999999998,10843.75,18.899999999999999,null,null,null,730,"6core 3.7GHz P7","12core",77200,147.24,6433.333333333333,12.270000000000001,2,null,null,null,null,8,3.5,27600,58.8,3450,7.35,null,null,null,"P5+/2 ",2100,12.46,null,null,"P5+/4 ",1900,24.48,null,null,null,null,null,null,null,null,null,null,null,null,"D04",4.4000000000000004,"F02",5.5,null,2136,73.099999999999994,null,null,"V3R6",null,"V3R7",null,"V4",null,null,null,null,2409,120,20,null,null,null,1511,2000,"SB2",2315,7350]
[null,1024,"16core 3.10-4.00GHz P10","16core",383400,null,23962.5,null,null,null,null,980,"24core 3.58-3.9GHz P9","96Core",1522000,2134.6,15854.166666666666,22.235416666666666,null,null,null,824,"12core 3.52GHz P8","24Core",230500,394.2,9604.1666666666661,16.425000000000001,null,null,null,730,"8core 3.55GHz P7","16core",97700,176.57,6106.25,11.035625,2,null,null,null,null,8,4.2,32650,68.2,4081.25,8.5250000000000004,null,null,"p5-505Q ","P5+/4 ",1650,20.25,null,null,"P5+/8 ",1900,46.36,null,null,null,null,null,null,null,null,null,null,null,null,"D06",5.5,"F04",7.3,620,2175,50,"Model","CPU","CPW",5250,"CPW",5250,"CPW",5250,null,null,250,2295,50,15,null,null,null,1512,3660,"SB3",2316,10000]
[null,1024,"24core 2.75-3.90GHz P10","24core",500500,null,20854.166666666668,null,null,null,null,980,"32core 3.9-4.0GHz P9","32Core",508900,722.2,15903.125,22.568750000000001,null,null,null,870,"32core 4.02GHz P8","32core",359000,630.4,11218.75,19.7,null,null,null,730,"4core 4.3GHz P7+","8core",59700,120.4,7462.5,15.05,2,null,null,null,null,8,5,37950,78.599999999999994,4743.75,9.8249999999999993,null,null,null,"P5/1 ",1500,3.25,null,null,"P5+/12 ",1900,66.55,null,null,null,null,null,null,null,null,null,null,null,null,"D10",5.3,"F06",9.6,null,2179,85.6,"40S",2109,24.5,8.4,27,9.4,27,9.4,null,null,null,2296,75,20,null,null,null,1513,4550,null,2318,16500]
{"$rows_left_out":285}
{"sheet":"＜参考資料＞パワーサイレンサーとスマートトレイ","index":6,"n_rows":3,"n_cols":11,"rows_kept":3,"cut":false,"hidden":false,"merged":[[0,0,0,20],[1,0,1,20]]}
["iGUAZU partnercontact <partnercontact@i-guazu.co.jp>へご依頼ください。"]
["※Power10構成には含まれません。"]
["■パワーサイレンサー",null,null,null,null,null,null,null,null,null,"■スマートトレイ"]

{"sheet":"vlook","index":7,"n_rows":22,"n_cols":11,"rows_kept":22,"cut":false,"hidden":true,"merged":[]}
[]
[null,null,null,"コア数",null,"プロセッサー","CPW","コントローラー","内蔵テープ","エディション","プロセッサーグループ"]
[null,"S914","9009-41A",4,{"$f":"C3&D3","v":"9009-41A4"},"POWER9\n#EP10",13125,"7.2GB(圧縮時)\n#EJ1D","不可","#EU2C","P05"]
[null,"S914","9009-41A",6,{"$f":"C4&D4","v":"9009-41A6"},"POWER9\n#EP11",13083.333000000001,"7.2GB(圧縮時)\n#EJ1D","不可","#EU2D","P10"]
[null,"S914","9009-41A",8,"9009-41A8","POWER9\n#EP12",15312.5,"7.2GB(圧縮時)\n#EJ1D","不可","なし","P10"]
[null,"S924","9009-42A",8,"9009-42A8","POWER9\n#EP1E",18187.5,null,null,"なし","P20"]
[null,"S924","9009-42A",16,"9009-42A16","POWER9\n#EP1E x2 ",16781.25,null,null,"なし","P20"]
[null,"S924","9009-42A",10,"9009-42A10","POWER9\n#EP1F",17450,null,null,"なし","P20"]
[null,"S924","9009-42A",20,"9009-42A20","POWER9\n#EP1F x2",15900,null,null,"なし","P20"]
[null,"S924","9009-42A",12,"9009-42A12","POWER9\n#EP1G",null,null,null,"なし","P20"]
[null,"S924","9009-42A",24,"9009-42A24","POWER9\n#EP1G x2",157112.5,null,null,"なし","P20"]
[null,"S814","8286-41A",4,"8286-41A4","POWER8\n#EPXK",9875,"7.2GB(圧縮時)\n#EJ0P",null,"#EU2C","P05"]
[null,"S814","8286-41A",6,"8286-41A6","POWER8\n#EPX0",{"$f":"59500/6","v":9916.6666666666661},"7.2GB(圧縮時)\n#EJ0P",null,"#EU2D","P10"]
[null,"S814","8286-41A",8,"8286-41A8","POWER8\n#EPX6",{"$f":"85500/8","v":10687.5},null,null,"なし","P10"]
[null,"S824","8286-42A",6,"8286-42A6","POWER8\n#EPXE",12000,null,null,"なし","P20"]
[null,"S824","8286-42A",12,"8286-42A12","POWER8\n#EPXE x2 ",{"$f":"130000/12","v":10833.333333333334},null,null,"なし","P20"]
[null,"S824","8286-42A",8,"8286-42A8","POWER8\n#EPXF",{"$f":"94500/8","v":11812.5},null,null,"なし","P20"]
[null,"S824","8286-42A",16,"8286-42A16","POWER8\n#EPXF x2",{"$f":"173500/16","v":10843.75},null,null,"なし","P20"]
[null,"S824","8286-42A",24,"8286-42A24","POWER8\n#EPXH x2",{"$f":"230500/24","v":9604.1666666666661},null,null,"なし","P20"]
[null,720,"8202-E4D",4,"8202-E4D4","POWER7+\n#EPCK",7100,"175MB\n(#EJ01)",null,"#0777"]
{"$rows_left_out":3}
{"sheet":"SWMA","index":8,"n_rows":5,"n_cols":6,"rows_kept":5,"cut":false,"hidden":true,"merged":[]}
[]
[null,"IBM i","WQE","WDS","RDW","PVE"]
["ライセンス",null,true,false,true]
["３年",true,true,null,true,true]
["１年",true,true,null,true,true]